Windows 10: The installation failed in the SAFE_OS phase with an error during BOOT operation...

Discus and support The installation failed in the SAFE_OS phase with an error during BOOT operation... in Windows 10 Installation and Upgrade to solve the problem; I decicded to update my pc to recent 20H2 update .. I am currently on 1809 . I tried all the methods - Media creation tool , Windows Update... Discussion in 'Windows 10 Installation and Upgrade' started by DPK47, Apr 20, 2021.

  1. DPK47 Win User

    The installation failed in the SAFE_OS phase with an error during BOOT operation...


    I decicded to update my pc to recent 20H2 update .. I am currently on 1809 .

    I tried all the methods - Media creation tool , Windows Update Assistant and from setting menu checking for update .. all 3 updates gives me same error during installation.


    The installation failed in the SAFE_OS phase with an error during BOOT operation 09xC1900101 - 0x20017 error .

    my all drivers are up to date.. checked in windows updates. also via manually from HP site..

    Below my pc specs .


    System Information:

    Machine Name = DPK47

    Manufacturer = Hewlett-Packard

    Model = HP 15 Notebook PC

    HostOSArchitecture = x64

    FirmwareType = UEFI

    BiosReleaseDate = 20180719000000.000000+000

    BiosVendor = F.49

    BiosVersion = F.49

    HostOSVersion = 10.0.17763

    HostOSBuildString = 17763.1.amd64fre.rs5_release.180914-1434

    TargetOSBuildString = 10.0.19041.621 vb_release_svc_prod1.201014-1758

    HostOSLanguageId =

    HostOSEdition = Professional

    RegisteredAV = Windows Defender



    I found some post related to this error they suggested run setupdiag .. I did and this from log file... plz if anyone can help me out of this ..





    Matching Profile found: FindRollbackFailure - 3A43C9B5-05B3-4F7C-A955-88F991BB5A48

    SetupDiag version: 1.6.0.0

    System Information:

    Machine Name = DPK47

    Manufacturer = Hewlett-Packard

    Model = HP 15 Notebook PC

    HostOSArchitecture = x64

    FirmwareType = UEFI

    BiosReleaseDate = 20180719000000.000000+000

    BiosVendor = F.49

    BiosVersion = F.49

    HostOSVersion = 10.0.17763

    HostOSBuildString = 17763.1.amd64fre.rs5_release.180914-1434

    TargetOSBuildString = 10.0.19041.621 vb_release_svc_prod1.201014-1758

    HostOSLanguageId =

    HostOSEdition = Professional

    RegisteredAV = Windows Defender

    FilterDrivers = FileInfo

    UpgradeStartTime = 19-04-2021 11:19:30 PM

    UpgradeEndTime = 20-04-2021 02:01:58 AM

    UpgradeElapsedTime = 02:42:28

    CV =

    ReportId =





    Error: SetupDiag reports rollback failure found.

    Last Phase = Finalize

    Last Operation = Remove System Restore checkpoints

    Error = 0xC1900101-0x20017

    LogEntry:



    Refer to "https://docs.microsoft.com/en-us/windows/desktop/Debug/system-error-codes" for error information.



    Last Setup Phase:

    Phase Name: Finalize

    Phase Started: 20-04-2021 02:01:11 AM

    Phase Ended: 20-04-2021 02:01:49 AM

    Phase Time Delta: 00:00:38

    Completed Successfully? True





    Last Setup Operation:

    Operation Name: Remove System Restore checkpoints

    Operation Started: 20-04-2021 02:01:31 AM

    Operation Ended: 20-04-2021 02:01:49 AM

    Operation Time Delta: 0:00:00:18.0000000

    Completed Successfully? True


    my one of the usb 3 port is not working .. can it be a reason why i am getting this error.. before this error i was getting migrate data error during the first phase boot..

    :)
     
    DPK47, Apr 20, 2021
    #1
  2. jewish Win User

    Installation failed in SAFE_OS phase with an error during BOOT operati

    Installation failed in SAFE_OS phase with an error during BOOT operation, 0xC1900101 – 0x20017
    i was trying to upgrade from windows 7 using a media creation tool after the installation my pc restarted and got an error that Installation failed in SAFE_OS phase with an error during BOOT operation, 0xC1900101 – 0x20017
     
    jewish, Apr 20, 2021
    #2
  3. BernardKM Win User
    Installation of Windows10 failed in SAFE_OS phase with error in BOOT

    I tried to install Windows 10 on my Samsung RX511 laptop but the installation failed towards the end of the installation procedure with the message:

    0xC1900101 - 0x20017

    The installation failed in SAFE_OS phase with an error in the BOOT operation.

    Has anyone experienced this failure on a Samsung RX511 laptop and found a fix for this problem?
     
    BernardKM, Apr 20, 2021
    #3
  4. Sasexx Win User

    The installation failed in the SAFE_OS phase with an error during BOOT operation...

    0xC19001 - 0x20017 the installation failed in SAFE_OS phase with un error during BOOT phase

    0xC19001 - 0x20017 the installation failed in SAFE_OS phase with un error during BOOT phase
     
    Sasexx, Apr 20, 2021
    #4
Thema:

The installation failed in the SAFE_OS phase with an error during BOOT operation...

Loading...
  1. The installation failed in the SAFE_OS phase with an error during BOOT operation... - Similar Threads - installation failed SAFE_OS

  2. The installation failed in the SAFE_OS phase with an error during REPLICATE_OC operation

    in Windows 10 Installation and Upgrade
    The installation failed in the SAFE_OS phase with an error during REPLICATE_OC operation: Whenever I try to reset my Windows 10 with the Media Creation Tool, it shows this error.[ATTACH] https://answers.microsoft.com/en-us/windows/forum/all/the-installation-failed-in-the-safeos-phase-with/7d6453d2-38bd-40c4-93d5-5818f03f14e3
  3. The installation failed in the SAFE_OS phase with an error during BOOT operation

    in Windows 10 Installation and Upgrade
    The installation failed in the SAFE_OS phase with an error during BOOT operation: hi i'm running on windows 10 1909 with latest system and drivers updates . a few weeks ago i found out that i can't boot into system from my personal usb winpe image i had used several times before but i didn`t pay so much attention cause it was not so important and i...
  4. INSTALLATION FAILED IN THE SAFE_OS PHASE WITH ERROR DURING PREPARE_ROLLBACK OPERATION

    in Windows 10 Installation and Upgrade
    INSTALLATION FAILED IN THE SAFE_OS PHASE WITH ERROR DURING PREPARE_ROLLBACK OPERATION: I have problem updating windows 10 1511 to 1909. 1. I have reset windows update 2. Disabled antivirus and firewall 3. Updated my BIOS and drivers 4. When I update using windows.iso I get error “INSTALLATION FAILED IN THESAFE_OS PHASE WITH ERROR DURING PREPARE_ROLLBACK...
  5. Installation failed in the SAFE_OS phase with an error during REPLICATE_OC operation

    in Windows 10 Installation and Upgrade
    Installation failed in the SAFE_OS phase with an error during REPLICATE_OC operation: Also writes: 0x8007001F-0x20006 Can you please help me i tried almost anything. I’m trying to update my windows 7 computer to windows 10 by using update tool I downloaded from Microsoft’s website. It writes “ 0x8007001F-0x20006 Installation failed in the SAFE_OS phase with...
  6. the installation failed in the safe_os phase with an error during boot operation

    in Windows 10 Installation and Upgrade
    the installation failed in the safe_os phase with an error during boot operation: 0xC1900101 - 0x20017 Trying to upgrade a Windows 7 machine to Windows 10 using the Media Creation Tool 1909. Install rolls back with this error. Logs per this article:...
  7. The Installation Failed In The Safe_OS Phase With An Error during Install_Updates Operation...

    in Windows 10 Installation and Upgrade
    The Installation Failed In The Safe_OS Phase With An Error during Install_Updates Operation...: Hello, I am trying to update windows 7 pro to windows 10 pro in the mediacreationtool. I have tried doing this 13 times, and every single time I get this error: The Installation Failed In The Safe_OS Phase With An Error during Install_Updates Operation 0x800f081f - 0x20003...
  8. the installation failed in the safe_os phase with an error during replicate_OC operation...

    in Windows 10 Installation and Upgrade
    the installation failed in the safe_os phase with an error during replicate_OC operation...: the installation failed in the safe_os phase with an error during replicate_OC operation 0x8007001F -0x20006 win 10 pro does not let me upgrade anymore from 1703 for the last 2 years...
  9. The Installation Failed In The Safe_OS Phase With An Error during Install_Updates Operation...

    in Windows 10 Installation and Upgrade
    The Installation Failed In The Safe_OS Phase With An Error during Install_Updates Operation...: I come across this problem, when i tried to update to the 1809 version and i didn't know what to do. Also I want to avoid performing clean instalation....
  10. The Installation Failed In The Safe_OS Phase With An Error During Apply_Image Operation...

    in Windows 10 Installation and Upgrade
    The Installation Failed In The Safe_OS Phase With An Error During Apply_Image Operation...: Hi! I tried to upgrade my PC to October Update ver. and that error happened. I want to avoid to perform clean installation, what could I do to overcome that error?...